{"text_format":"1","workbook":"xlsx","n_sheets":14,"sheets":["Menu","Seq. Operacional","Transf Seq Op.","Consulta Seq. Operacional","BD Seq Op","Ficha Acompanhamento","Cliente","OP","Consulta OP","BD da OP","Operações","Ref","Cores","Tamanhos"],"not_rendered":{"charts":0,"images":1,"macros":1,"external_links":0,"defined_names":36,"comments":6,"pivot_tables":0},"unopened":[],"bounds":{"document_bytes":16777216,"sheet_cells":100000,"rows_first":2000,"rows_last":500,"rows_between":2000,"halvings":0,"cell_chars":16384,"cell_head_chars":4096},"cells_cut":0,"cells_raw":0,"read":"whole","date_system":"1900"}

{"sheet":"Menu","index":0,"n_rows":64,"n_cols":9,"rows_kept":64,"cut":false,"hidden":false,"merged":[[19,2,19,9],[21,8,21,10],[21,3,21,7],[23,1,23,10]]}
[]
[]
[]
[]
[]
[]
[]
[]
[]
[]
{"$rows_left_out":55}
{"sheet":"Seq. Operacional","index":1,"n_rows":130,"n_cols":14,"rows_kept":130,"cut":false,"hidden":false,"merged":[[2,2,2,5],[1,3,1,4]]}
[null,null,"Sequência Operacional e Tempo Padrão",null,"Data cadastro:",{"$f":"TODAY()","v":"2016-09-16"},null,null,null,null,null,null,null,{"$f":"IF(OR(F1=0,C2=0),0,1)","v":0}]
[null,null,null,null,null,null,null,null,null,null,null,null,null,{"$f":"IF(OR(C6=0,C7=0),0,1)","v":0}]
[null,null,{"$f":"IF(C2=0,\"\",VLOOKUP(C2,Ref!A:B,2,FALSE))","v":""},null,null,null,null,null,null,null,null,null,null,{"$f":"IF(C2=0,\"\",IF(ISERROR(VLOOKUP(C2,'BD Seq Op'!B:H,1,FALSE)),\"\",\"Já cadastrada.\"))","v":""}]
["Filtro","Seq.","Descrição operacional","Tipo\nMáq.","Tipo\nApar.","Tempo\nPadrão"]
["Sim","Seq.","Descrição  das  Operações","Tipo\nMáq.","Tipo\nApar.","Tempo\nPadrão",null,{"$f":"IF(SUM(G6:G125)>0,\" ATENÇÃO! Você deixou alguma linha acima em branco, não é permitido.\",\"\")","v":""},null,null,null,null,null,{"$f":"IF(N3=\"Já cadastrada.\",\"- - -\",IF(SUM(N6:N125)>0,\"- - -\",IF(N1+N2=2,\"Cadastrar\",\"- - -\")))","v":"- - -"}]
[{"$f":"IF(C6=0,\"Não\",\"Sim\")","v":"Não"},10,null,null,null,{"$f":"IF(C6=0,0,IF(ISERROR(VLOOKUP(C6,Operações!A:D,4,FALSE)),0,VLOOKUP(C6,Operações!A:D,4,FALSE)))","v":0},null,null,null,null,null,null,null,{"$f":"IF(C6=0,0,IF(F6<>0,0,1))","v":0}]
[{"$f":"IF(C7=0,\"Não\",\"Sim\")","v":"Não"},20,null,null,null,{"$f":"IF(C7=0,0,IF(ISERROR(VLOOKUP(C7,Operações!A:D,4,FALSE)),0,VLOOKUP(C7,Operações!A:D,4,FALSE)))","v":0},{"$f":"IF(AND(C6=0,C7<>0),1,0)","v":0},null,null,null,null,null,null,{"$f":"IF(C7=0,0,IF(F7<>0,0,1))","v":0}]
["Não",30,null,null,null,{"$f":"IF(C8=0,0,IF(ISERROR(VLOOKUP(C8,Operações!A:D,4,FALSE)),0,VLOOKUP(C8,Operações!A:D,4,FALSE)))","v":0},{"$f":"IF(AND(C7=0,C8<>0),1,0)","v":0},null,null,null,null,null,null,0]
["Não",40,null,null,null,{"$f":"IF(C9=0,0,IF(ISERROR(VLOOKUP(C9,Operações!A:D,4,FALSE)),0,VLOOKUP(C9,Operações!A:D,4,FALSE)))","v":0},{"$f":"IF(AND(C8=0,C9<>0),1,0)","v":0},null,null,null,null,null,null,0]
["Não",50,null,null,null,{"$f":"IF(C10=0,0,IF(ISERROR(VLOOKUP(C10,Operações!A:D,4,FALSE)),0,VLOOKUP(C10,Operações!A:D,4,FALSE)))","v":0},0,null,null,null,null,null,null,0]
{"$rows_left_out":121}
{"sheet":"Transf Seq Op.","index":2,"n_rows":2,"n_cols":10,"rows_kept":2,"cut":false,"hidden":false,"merged":[]}
[null,{"$f":"'Seq. Operacional'!$C$2","v":0},{"$f":"CONCATENATE(B1,\"-\",A1)","v":"0-"},null,null,null,null,{"$f":"'Seq. Operacional'!$F$1","v":"2016-09-16"},{"$f":"IF(E1=0,0,CONCATENATE(B1,\"-\",E1))","v":0},{"$f":"IF(F1=0,0,CONCATENATE(B1,\"-\",F1))","v":0}]
["Seq.","Ref.","Concatenar","Descrição  das  Operações","Tipo\nMáq.","Tipo\nApar.","Tempo\nPadrão","Data do\nCadastro","Somase\nMáquina","Somase\nAparelho"]

{"sheet":"Consulta Seq. Operacional","index":3,"n_rows":130,"n_cols":14,"rows_kept":130,"cut":false,"hidden":false,"merged":[[2,2,2,5]]}
[null,null,"Sequência Operacional e Tempo Padrão",null,"Data cadastro:",{"$f":"IF($C$2=0,\"\",IF(ISERROR(VLOOKUP($C$2&\"-\"&B6,'BD Seq Op'!C:H,6,FALSE)),\"\",VLOOKUP($C$2&\"-\"&B6,'BD Seq Op'!C:H,6,FALSE)))","v":""},null,null,null,null,null,null,null,{"$f":"IF(C2=0,\"\",IF(ISERROR(VLOOKUP(C2&\"-\"&B6,'BD Seq Op'!C:H,6,FALSE)),\"Não cadastrada.\",\"\"))","v":""}]
[]
[null,null,{"$f":"IF(C2=0,\"\",IF(N1=\"Não cadastrada.\",\"\",VLOOKUP(C2,Ref!A:B,2,FALSE)))","v":""}]
["Filtro","Seq.","Descrição operacional","Tipo\nMáq.","Tipo\nApar.","Tempo\nPadrão"]
["Sim","Seq.","Descrição  das  Operações","Tipo\nMáq.","Tipo\nApar.","Tempo\nPadrão"]
[{"$f":"IF(C6=\"\",\"Não\",\"Sim\")","v":"Não"},1,{"$f":"IF($C$2=0,\"\",IF(ISERROR(VLOOKUP($C$2&\"-\"&$B6,'BD Seq Op'!$C:$H,2,FALSE)),\"\",VLOOKUP($C$2&\"-\"&$B6,'BD Seq Op'!$C:$H,2,FALSE)))","v":""},null,null,{"$f":"IF($C$2=0,\"\",IF(ISERROR(VLOOKUP($C$2&\"-\"&$B6,'BD Seq Op'!$C:$H,5,FALSE)),\"\",VLOOKUP($C$2&\"-\"&$B6,'BD Seq Op'!$C:$H,5,FALSE)))","v":""}]
[{"$f":"IF(C7=\"\",\"Não\",\"Sim\")","v":"Não"},2,{"$f":"IF($C$2=0,\"\",IF(ISERROR(VLOOKUP($C$2&\"-\"&$B7,'BD Seq Op'!$C:$H,2,FALSE)),\"\",VLOOKUP($C$2&\"-\"&$B7,'BD Seq Op'!$C:$H,2,FALSE)))","v":""},null,null,{"$f":"IF($C$2=0,\"\",IF(ISERROR(VLOOKUP($C$2&\"-\"&$B7,'BD Seq Op'!$C:$H,5,FALSE)),\"\",VLOOKUP($C$2&\"-\"&$B7,'BD Seq Op'!$C:$H,5,FALSE)))","v":""}]
["Não",3,{"$f":"IF($C$2=0,\"\",IF(ISERROR(VLOOKUP($C$2&\"-\"&$B8,'BD Seq Op'!$C:$H,2,FALSE)),\"\",VLOOKUP($C$2&\"-\"&$B8,'BD Seq Op'!$C:$H,2,FALSE)))","v":""},null,null,{"$f":"IF($C$2=0,\"\",IF(ISERROR(VLOOKUP($C$2&\"-\"&$B8,'BD Seq Op'!$C:$H,5,FALSE)),\"\",VLOOKUP($C$2&\"-\"&$B8,'BD Seq Op'!$C:$H,5,FALSE)))","v":""}]
["Não",4,{"$f":"IF($C$2=0,\"\",IF(ISERROR(VLOOKUP($C$2&\"-\"&$B9,'BD Seq Op'!$C:$H,2,FALSE)),\"\",VLOOKUP($C$2&\"-\"&$B9,'BD Seq Op'!$C:$H,2,FALSE)))","v":""},null,null,{"$f":"IF($C$2=0,\"\",IF(ISERROR(VLOOKUP($C$2&\"-\"&$B9,'BD Seq Op'!$C:$H,5,FALSE)),\"\",VLOOKUP($C$2&\"-\"&$B9,'BD Seq Op'!$C:$H,5,FALSE)))","v":""}]
["Não",5,{"$f":"IF($C$2=0,\"\",IF(ISERROR(VLOOKUP($C$2&\"-\"&$B10,'BD Seq Op'!$C:$H,2,FALSE)),\"\",VLOOKUP($C$2&\"-\"&$B10,'BD Seq Op'!$C:$H,2,FALSE)))","v":""},null,null,{"$f":"IF($C$2=0,\"\",IF(ISERROR(VLOOKUP($C$2&\"-\"&$B10,'BD Seq Op'!$C:$H,5,FALSE)),\"\",VLOOKUP($C$2&\"-\"&$B10,'BD Seq Op'!$C:$H,5,FALSE)))","v":""}]
{"$rows_left_out":121}
{"sheet":"BD Seq Op","index":4,"n_rows":21,"n_cols":10,"rows_kept":21,"cut":false,"hidden":false,"merged":[]}
["Seq.   .","Ref.","Concatenar","Descrição das Operações","Tipo\nMáq.","Tipo\nApar.","Tempo\nPadrão","Data do\nCadastro","Somase\nMáquina","Somase\nAparelho"]
[1,10000,{"$f":"CONCATENATE(B2,\"-\",A2)","v":"10000-1"},"Bainha 2 ag. mangas",null,null,0.39,"2016-09-15",{"$f":"IF(E2=0,0,CONCATENATE(B2,\"-\",E2))","v":0},{"$f":"IF(F2=0,0,CONCATENATE(B2,\"-\",F2))","v":0}]
[2,10000,"10000-2","Separar mangas c/ tesoura",null,null,0.1,"2016-09-15",0,0]
[3,10000,"10000-3","Fechar ombros e laterais",null,null,0.75,"2016-09-15",0,0]
[4,10000,"10000-4","Fechar ribana decote e pregar",null,null,0.5,"2016-09-15",0,0]
[5,10000,"10000-5","Rematar mangas",null,null,0.8,"2016-09-15",0,0]
[6,10000,"10000-6","Pregar mangas fechada",null,null,0.7,"2016-09-15",0,0]
[7,10000,"10000-7","Bainha 2 ag. barra",null,null,0.47,"2016-09-15",0,0]
[8,10000,"10000-8","Revisar e limpar fios",null,null,1.1000000000000001,"2016-09-15",0,0]
[9,10000,"10000-9","Colocar tag na peça",null,null,0.16,"2016-09-15",0,0]
{"$rows_left_out":12}
{"sheet":"Ficha Acompanhamento","index":5,"n_rows":129,"n_cols":31,"rows_kept":129,"cut":false,"hidden":false,"merged":[[0,6,0,8],[5,1,5,4],[0,13,0,14]]}
[null,null,null,null,null,null,{"$f":"IF(U1=TRUE,\"Tempo para Produzir\",\"\")","v":""},null,null,null,null,0.1,"Cor :",null,null,null,null,null,null,null,false]
[null,null,null,null,null,null,{"$f":"IF(U1=TRUE,\"Operador(a)\",\"\")","v":""},{"$f":"IF(U1=TRUE,\"Dias\",\"\")","v":""},{"$f":"IF(U1=TRUE,\"+ Horas\",\"\")","v":""},null,"Qtde Peças :",null,"Tam. :",null,null,null,null,null,null,null,false]
[null,null,null,null,null,null,{"$f":"IF(U1=TRUE,L5,\"\")","v":""},{"$f":"IF(G3=\"\",\"\",IF(OR(L5=0,M5=0),0,V5))","v":""},{"$f":"IF(G3=\"\",\"\",AB5)","v":""}]
[null,null,null,null,null,null,null,null,null,null,"Total Min.","Operador(a)","Min./dia","Dias","+ Horas","Qtde peças"]
[null,null,null,null,null,null,null,null,null,null,{"$f":"F129","v":6720},null,null,{"$f":"V5","v":0},{"$f":"AB5","v":"0:00"},null,null,null,null,null,{"$f":"IF(OR(L5=0,M5=0),0,K5/(L5*M5))","v":0},{"$f":"ROUNDDOWN(U5,0)","v":0},{"$f":"U5-V5","v":0},{"$f":"(W5*M5)/60","v":0},{"$f":"ROUNDDOWN(X5,0)","v":0},{"$f":"(X5-Y5)*60","v":0},{"$f":"ROUNDDOWN(Z5,0)","v":0},{"$f":"IF(AA5<10,Y5&\":0\"&AA5,Y5&\":\"&AA5)","v":"0:00"}]
[null,{"$f":"S18","v":"                                             ***   CLIENTE ESPECIAL   ***\n*** Verificar instruções das etiquetas conforme ficha técnica ***"},null,null,null,null,null,null,null,null,null,null,null,null,null,{"$f":"IF(AND(P5=0,U1=TRUE),\"Informe a qtde de peças.\",\"\")","v":""}]
["Filtro","Seq.","Descrição das operações","Tempo\nPadrão","Pçs/h\n100%","Código\nCostureira","Código\nCostureira","Qtde\nPeças","Tempo /\nPacote"]
["Sim","Seq.","Descrição das Operações","Tempo\nPadrão","Pçs/h\n100%","Código\nOperador(a)","Código\nOperador(a)","Qtde\nPeças","Tempo /\nPacote"]
[{"$f":"IF(C9=0,\"Não\",\"Sim\")","v":"Sim"},1,{"$f":"IF($L$1=0,0,IF(ISERROR(VLOOKUP($U$11&\"-\"&B9,'BD Seq Op'!C:H,2,FALSE)),0,VLOOKUP($U$11&\"-\"&B9,'BD Seq Op'!C:H,2,FALSE)))","v":"Fazer bainha mangas"},{"$f":"IF($L$1=0,0,IF(ISERROR(VLOOKUP($U$11&\"-\"&B9,'BD Seq Op'!C:H,5,FALSE)),0,VLOOKUP($U$11&\"-\"&B9,'BD Seq Op'!C:H,5,FALSE)))","v":0.95},{"$f":"IF(C9=0,\"\",IF($U$1=TRUE,(60*$L$5)/D9,60/D9))","v":63.15789473684211},null,null,{"$f":"IF(C9=0,\"\",IF($U$1=TRUE,$P$5,IF($L$2=0,$V$15,$L$2)))","v":800},{"$f":"IF(C9=0,\"\",IF(AE9=TRUE,0,D9*H9))","v":760},null,null,null,null,null,null,null,null,"Nº OP :  ",{"$f":"IF(L1=0,\"\",CONCATENATE(R9,U9))","v":"Nº OP :  0,1"},null,{"$f":"IF(L1=0,\"\",L1)","v":0.1},null,null,null,null,null,null,null,null,null,false]
[{"$f":"IF(C10=0,\"Não\",\"Sim\")","v":"Sim"},2,{"$f":"IF($L$1=0,0,IF(ISERROR(VLOOKUP($U$11&\"-\"&B10,'BD Seq Op'!C:H,2,FALSE)),0,VLOOKUP($U$11&\"-\"&B10,'BD Seq Op'!C:H,2,FALSE)))","v":"Fechar ombros"},{"$f":"IF($L$1=0,0,IF(ISERROR(VLOOKUP($U$11&\"-\"&B10,'BD Seq Op'!C:H,5,FALSE)),0,VLOOKUP($U$11&\"-\"&B10,'BD Seq Op'!C:H,5,FALSE)))","v":0.42},142.85714285714286,null,null,{"$f":"IF(C10=0,\"\",IF($U$1=TRUE,$P$5,IF($L$2=0,$V$15,$L$2)))","v":800},{"$f":"IF(C10=0,\"\",IF(AE10=TRUE,0,D10*H10))","v":336},null,null,null,null,null,null,null,null,"Data Emissão : ",{"$f":"IF(L1=0,\"\",IF(U10=0,R10,CONCATENATE(R10,TEXT(U10,\"dd/mm/aaaa\"))))","v":"Data Emissão : 05/09/2016"},null,{"$f":"IF($L$1=0,\"\",IF(ISERROR(VLOOKUP($L$1,'BD da OP'!$A:$AC,3,FALSE)),\"\",VLOOKUP($L$1,'BD da OP'!$A:$AC,3,FALSE)))","v":"2016-09-05"},null,null,null,null,null,null,null,null,null,false]
{"$rows_left_out":120}
{"sheet":"Cliente","index":6,"n_rows":4,"n_cols":6,"rows_kept":4,"cut":false,"hidden":false,"merged":[]}
[{"$f":"F1","v":"Cliente"},{"$f":"CONCATENATE(\"Observações \",F1,\" nas OPs\")","v":"Observações Cliente nas OPs"},null,null,null,"Cliente"]
["Magazine de Confecções Ltda.","                      ****   CLIENTE ESPECIAL  ****\nUtilizar etiquetas de composição e bordada enviadas pelo Cliente."]
["Maria & Maria","Utilizar etiquetas do Cliente.\nColocar TAGs do Cliente nas peças quando embaladas."]
["Pepe","                     ****   CLIENTE ESPECIAL  ****\nUtilizar etiquetas de composição e bordada enviadas pelo Cliente.\nColocar TAGs do Cliente nas peças quando forem embaladas."]

{"sheet":"OP","index":7,"n_rows":21,"n_cols":29,"rows_kept":21,"cut":false,"hidden":false,"merged":[[12,8,12,13],[6,1,6,5],[8,1,8,6],[10,1,10,6],[8,8,8,13],[10,8,10,13]]}
["Nº OP :",null,null,null,null,null,null,null,null,null,null,null,null,null,null,{"$f":"IF(B1=0,\"não\",IF(ISERROR(VLOOKUP(B1,'BD da OP'!A:A,1,FALSE)),\"não\",VLOOKUP(B1,'BD da OP'!A:A,1,FALSE)))","v":"não"}]
["Data Emissão :",{"$f":"TODAY()","v":"2016-09-16"},null,null,null,null,null,null,null,null,null,null,null,null,null,{"$f":"IF(B1=P1,\"OP já cadastrada, se necessário poderá utilizar vírgula para diferenciar a mesma OP. Exemplo: OP 1234,1 / 1234,2  .....\",\"\")","v":""}]
["Referência :",null,{"$f":"IF(P1<>\"não\",\"\",IF(B3=0,\"\",VLOOKUP(B3,Ref!A:B,2,FALSE)))","v":""},null,null,null,null,null,null,null,null,null,null,null,null,{"$f":"IF(B1=0,\"- - - - - -\",IF(B2=0,\"- - - - - -\",IF(B3=0,\"- - - - - -\",\"Cadastrar\")))","v":"- - - - - -"}]
["Cores :",null,null,null,null,null,null,null,null,null,null,null,null,null,null,{"$f":"Cliente!F1","v":"Cliente"}]
["Tamanhos :"]
["Qtde de Peças :"]
[{"$f":"CONCATENATE(Cliente!F1,\" :\")","v":"Cliente :"}]
["Previsão Entrega :",null,null,null,null,null,null,null,"Observações que costumam utilizar, para facilitar nas novas OPs. (opcional)"]
["Observações \npara esta OP:",null,null,null,null,null,null,null,"                                             ***   CLIENTE ESPECIAL   ***\n*** Verificar instruções das etiquetas conforme ficha técnica ***"]
[]
{"$rows_left_out":12}
{"sheet":"Consulta OP","index":8,"n_rows":9,"n_cols":14,"rows_kept":9,"cut":false,"hidden":false,"merged":[[6,1,6,5],[8,1,8,6]]}
["Nº OP :",{"$f":"IF($N$1=0,\"\",OFFSET('BD da OP'!A1,$N$1,0))","v":0.2},null,null,null,null,null,null,null,null,null,null,null,2]
["Data Emissão :",{"$f":"IF($N$1=0,\"\",OFFSET('BD da OP'!C1,$N$1,0))","v":"2016-08-28"}]
["Referência :",{"$f":"IF($N$1=0,\"\",OFFSET('BD da OP'!D1,$N$1,0))","v":10000},{"$f":"IF($N$1=0,\"\",OFFSET('BD da OP'!E1,$N$1,0))","v":"Camiseta básica lisa"}]
["Cores :",{"$f":"IF($N$1=0,\"\",OFFSET('BD da OP'!F1,$N$1,0))","v":"Branco"},{"$f":"IF($N$1=0,\"\",OFFSET('BD da OP'!G1,$N$1,0))","v":"Laranja"},{"$f":"IF($N$1=0,\"\",OFFSET('BD da OP'!H1,$N$1,0))","v":"Marinho"},{"$f":"IF($N$1=0,\"\",OFFSET('BD da OP'!I1,$N$1,0))","v":0},{"$f":"IF($N$1=0,\"\",OFFSET('BD da OP'!J1,$N$1,0))","v":0},{"$f":"IF($N$1=0,\"\",OFFSET('BD da OP'!K1,$N$1,0))","v":0},{"$f":"IF($N$1=0,\"\",OFFSET('BD da OP'!L1,$N$1,0))","v":0},{"$f":"IF($N$1=0,\"\",OFFSET('BD da OP'!M1,$N$1,0))","v":0},{"$f":"IF($N$1=0,\"\",OFFSET('BD da OP'!N1,$N$1,0))","v":0},{"$f":"IF($N$1=0,\"\",OFFSET('BD da OP'!O1,$N$1,0))","v":0}]
["Tamanhos :",{"$f":"IF($N$1=0,\"\",OFFSET('BD da OP'!P1,$N$1,0))","v":"PP"},{"$f":"IF($N$1=0,\"\",OFFSET('BD da OP'!Q1,$N$1,0))","v":"P"},{"$f":"IF($N$1=0,\"\",OFFSET('BD da OP'!R1,$N$1,0))","v":"M"},{"$f":"IF($N$1=0,\"\",OFFSET('BD da OP'!S1,$N$1,0))","v":"G"},{"$f":"IF($N$1=0,\"\",OFFSET('BD da OP'!T1,$N$1,0))","v":0},{"$f":"IF($N$1=0,\"\",OFFSET('BD da OP'!U1,$N$1,0))","v":0},{"$f":"IF($N$1=0,\"\",OFFSET('BD da OP'!V1,$N$1,0))","v":0},{"$f":"IF($N$1=0,\"\",OFFSET('BD da OP'!W1,$N$1,0))","v":0},{"$f":"IF($N$1=0,\"\",OFFSET('BD da OP'!X1,$N$1,0))","v":0},{"$f":"IF($N$1=0,\"\",OFFSET('BD da OP'!Y1,$N$1,0))","v":0}]
["Qtde de Peças :",{"$f":"IF($N$1=0,\"\",OFFSET('BD da OP'!Z1,$N$1,0))","v":1500}]
["Cliente :",{"$f":"IF($N$1=0,\"\",OFFSET('BD da OP'!AA1,$N$1,0))","v":"Pepe"}]
["Previsão Entrega :",{"$f":"IF($N$1=0,\"\",OFFSET('BD da OP'!AB1,$N$1,0))","v":"2016-09-25"}]
["Observações \npara esta OP:",{"$f":"IF($N$1=0,\"\",IF(ISERROR(VLOOKUP(B1,'BD da OP'!A:AC,29,FALSE)),\"\",VLOOKUP(B1,'BD da OP'!A:AC,29,FALSE)))","v":"****   CLIENTE ESPECIAL  ****\nUtilizar etiquetas de composição e bordada enviadas pelo Cliente.\nColocar TAGs do Cliente nas peças quando forem embaladas."}]

{"sheet":"BD da OP","index":9,"n_rows":3,"n_cols":29,"rows_kept":3,"cut":false,"hidden":false,"merged":[]}
["Nº OP.   .","Concatenar","Data\nEmissão   .","Ref.","Descrição\nda Ref.","Cor\n1","Cor\n2","Cor\n3","Cor\n4","Cor\n5","Cor\n6","Cor\n7","Cor\n8","Cor\n9","Cor\n10","Tam\n1","Tam\n2","Tam\n3","Tam\n4","Tam\n5","Tam\n6","Tam\n7","Tam\n8","Tam\n9","Tam\n10","Qtde\nPeças","Cliente","Previsão\nEntrega","Observações"]
[0.1,{"$f":"CONCATENATE(\"Nº OP:  \",A2,\"  -  Ref:  \",D2)","v":"Nº OP:  0,1  -  Ref:  10150"},"2016-09-05",10150,"Camiseta básica lisa c/ bordado no peito","Branco","Laranja","Marinho",0,0,0,0,0,0,0,"PP","P","M","G",0,0,0,0,0,0,800,"Magazine de Confecções Ltda.","2016-10-05","                                             ***   CLIENTE ESPECIAL   ***\n*** Verificar instruções das etiquetas conforme ficha técnica ***"]
[0.2,{"$f":"CONCATENATE(\"Nº OP:  \",A3,\"  -  Ref:  \",D3)","v":"Nº OP:  0,2  -  Ref:  10000"},"2016-08-28",10000,"Camiseta básica lisa","Branco","Laranja","Marinho",0,0,0,0,0,0,0,"PP","P","M","G",0,0,0,0,0,0,1500,"Pepe","2016-09-25","****   CLIENTE ESPECIAL  ****\nUtilizar etiquetas de composição e bordada enviadas pelo Cliente.\nColocar TAGs do Cliente nas peças quando forem embaladas."]

{"sheet":"Operações","index":10,"n_rows":19,"n_cols":4,"rows_kept":19,"cut":false,"hidden":false,"merged":[]}
["Descrição das Operações","Tipo de\nMáquina","Tipo de\nAparelho","Tempo\nPadrão"]
["Bainha 2 ag. barra"]
["Bainha 2 ag. mangas"]
["Colocar tag na peça"]
["Dobrar peça e embalar"]
["Fechar laterais c/ etiq"]
["Fechar ombros"]
["Fechar ombros e laterais"]
["Fechar ombros e laterais c/ etiq"]
["Fechar ribana decote e pregar"]
{"$rows_left_out":10}
{"sheet":"Ref","index":11,"n_rows":3,"n_cols":2,"rows_kept":3,"cut":false,"hidden":false,"merged":[]}
["Ref.","Descrição da Referência"]
[10000,"Camiseta básica lisa"]
[10150,"Camiseta com estampa na frente"]

{"sheet":"Cores","index":12,"n_rows":13,"n_cols":1,"rows_kept":13,"cut":false,"hidden":false,"merged":[]}
["Cores"]
["Amarelo"]
["Azul"]
["Bigode"]
["Branco"]
["Cinza"]
["Destroyed"]
["Laranja"]
["Marinho"]
["Preto"]
{"$rows_left_out":4}
{"sheet":"Tamanhos","index":13,"n_rows":22,"n_cols":1,"rows_kept":22,"cut":false,"hidden":false,"merged":[]}
["Tamanhos"]
["01"]
["02"]
["03"]
["10"]
["12"]
["14"]
["16"]
["2"]
["34"]
{"$rows_left_out":12}