{"text_format":"1","workbook":"xlsx","n_sheets":2,"sheets":["Cálculo","Malhas"],"not_rendered":{"charts":0,"images":0,"macros":1,"external_links":0,"defined_names":3,"comments":2,"pivot_tables":0},"unopened":[],"bounds":{"document_bytes":16777216,"sheet_cells":100000,"rows_first":2000,"rows_last":500,"rows_between":2000,"halvings":0,"cell_chars":16384,"cell_head_chars":4096},"cells_cut":0,"cells_raw":0,"read":"whole","date_system":"1900"}

{"sheet":"Cálculo","index":0,"n_rows":16,"n_cols":20,"rows_kept":16,"cut":false,"hidden":false,"merged":[[3,15,3,17]]}
[]
[]
[]
[null,null,null,"Pontas do enfesto: ",null,0.05,null,"m"]
[]
[null,null,null,"Rendimento da malha: ",null,2.31,null,"m / kg",null,null,null,null,null,null,null,"Largura ( mt ): ",null,{"$f":"IF(T6>0,0,IF($P$4=0,0,VLOOKUP($P$4,Malhas!A:D,2,FALSE)))","v":0}]
[]
[null,null,null,"Comprimento do enfesto: ",null,3.85,null,"m",null,null,null,null,null,null,null,"Comprimento ( mt ): ",null,{"$f":"IF(T6>0,0,IF($P$4=0,0,VLOOKUP($P$4,Malhas!A:D,3,FALSE)))","v":0}]
[]
[null,null,null,"Qtde peças encaixadas: ",null,5.5,null,"pç",null,null,null,null,null,null,null,"Peso (Kg): ",null,{"$f":"IF(T6>0,0,IF($P$4=0,0,VLOOKUP($P$4,Malhas!A:D,4,FALSE)))","v":0}]
[]
[null,null,null,"Consumo Debrum / Friso / Viés por peça: ",null,2.35E-2,null,"m",null,null,null,null,null,null,null,"Gramatura: ",null,{"$f":"IF(R10=0,0,(R10*1)/(R6*R8)*1000)","v":0},null,{"$f":"IF(T10=0,0,(T10*1)/(T6*T8)*1000)","v":0}]
[null,null,null,null,null,{"$f":"IF(F10=0,0,(F8+F4)/F10)","v":0.70909090909090911}]
[null,null,null,"Total consumo por peça",null,{"$f":"F13+F12","v":0.73259090909090907},null,"m"]
[]
[null,null,null,"Consumo para Custo           ",null,{"$f":"IF(F6=0,0,IF(F14=0,0,ROUND(F14*1/F6,3)))","v":0.317},null,{"$f":"IF(F16>0,\"Kg\",\"\")","v":"Kg"},null,null,null,null,null,null,null,"Rendimento: ",null,{"$f":"IF(R10=0,0,R8/R10)","v":0},null,{"$f":"IF(T10=0,0,T8/T10)","v":0}]

{"sheet":"Malhas","index":1,"n_rows":11,"n_cols":4,"rows_kept":11,"cut":false,"hidden":false,"merged":[]}
["Malha","Largura total\n(m)","Compri-\nmento\n(m)","Peso\nKg"]
["DEVORE AGUA ",1.65,3,0.53500000000000003]
["FORRO MALHA",1.5,3,0.67500000000000004]
["LUREX DOURADO",1.63,3,0.56499999999999995]
["LUREX PRATA",1.56,3,0.54]
["RADIOSA LIST",1.43,3,0.86499999999999999]
["RIBANA DE LUREX DOURADA",1.55,3,0.61499999999999999]
["RIBANA DE LUREX PRATA",1.58,3,0.61499999999999999]
["TULE",1.31,3,0.28499999999999998]
["VISCOCREPE",1.61,3,0.95499999999999996]
["VISCOSE",1.72,5.37,2.3250000000000002]